Hi, after following the C++ Sqlite example from the community I find an error trying to compile the c++ lib. Any idea what might be happening? [cmake]: – Found the following Boost libraries:
[cmake]: – regex
[cmake]: – Configuring done
[cmake]: – Generating done
[cmake]: – Build files have been written to: C:/Users/ht3b3d/eclipse-workspace/FirstSQL/intermediate/cmake/AXCF2152,19.0.0.17548/Release
[cmake]: [ 12%] Building CXX object CMakeFiles/FirstSQL.dir/intermediate/code/FirstSQLLibrary.cpp.o
[cmake]: [ 25%] Building CXX object CMakeFiles/FirstSQL.dir/intermediate/code/FirstSQLLibrary.meta.cpp.o
[cmake]: [ 37%] Building CXX object CMakeFiles/FirstSQL.dir/intermediate/code/MyComponent.meta.cpp.o
[cmake]: [ 50%] Building CXX object CMakeFiles/FirstSQL.dir/intermediate/code/MyComponentProgramProvider.cpp.o
[cmake]: [ 62%] Building CXX object CMakeFiles/FirstSQL.dir/src/MyComponent.cpp.o
[cmake]: [ 75%] Building CXX object CMakeFiles/FirstSQL.dir/src/MyProgram.cpp.o
[cmake]: [ 87%] Linking CXX shared library libFirstSQL.so
[cmake]: CMakeFiles/FirstSQL.dir/src/MyComponent.cpp.o: In functionFirstSQL::MyComponent::SetupConfig()': [cmake]: MyComponent.cpp:(.text+0x2a): undefined reference tosqlite3_open’
[cmake]: MyComponent.cpp:(.text+0x42): undefined reference tosqlite3_close' [cmake]: MyComponent.cpp:(.text+0x4e): undefined reference tosqlite3_errmsg’
[cmake]: collect2.exe: error: ld returned 1 exit status
[cmake]: make.exe[2]: *** [CMakeFiles/FirstSQL.dir/build.make:185: libFirstSQL.so] Error 1
[cmake]: make.exe[1]: *** [CMakeFiles/Makefile2:73: CMakeFiles/FirstSQL.dir/all] Error 2
[cmake]: make.exe: *** [Makefile:130: all] Error 2
cmake process exited with error Thanks, Angel