ECLIPSE Erstinbetriebnahme

Hallo PLCnext Team, ich habe Probleme bei der Erstinbetriebnahme von Eclipse bzw. bei der Übersetzung einen Projektes. folgende Fehlermeldung habe ich(Logausdruck); Ich habe nach Video die Erstintallation realisiert, die lief ohne Fehler ab. Sorry Text war zu lang…

Hello papabaer, do you have questions about “ECLIPSE Erstinbetriebnahme” ??

Hallo PLCnext Team, ich habe Probleme bei der Erstinbetriebnahme von Eclipse bzw. bei der Übersetzung einen Projektes. folgende Fehlermeldung habe ich(Logausdruck); [quote]cmd.exe /c ““D:\\PHOENIX CONTACT\\PLCnCLI 2019.0 LTS/plcncli.exe” generate code -p"C:/Users/Student/eclipse-workspace/Test”" Successfully generated all files with the ‘code’ generator for C:\\Users\\Student\\eclipse-workspace\\Test. cmd.exe /c ““D:\\PHOENIX CONTACT\\PLCnCLI 2019.0 LTS/plcncli.exe” generate config -p"C:/Users/Student/eclipse-workspace/Test”" Successfully generated all files with the ‘config’ generator for C:\\Users\\Student\\eclipse-workspace\\Test. cmd.exe /c ““D:\\PHOENIX CONTACT\\PLCnCLI 2019.0 LTS/plcncli.exe” build -p"C:/Users/Student/eclipse-workspace/Test” -b Release" Requested build for targets AXCF2152,19.0.0.17548 Starting build for target AXCF2152,19.0.0.17548 Checking if CMake needs to be reconfigured… [cmake]: – Boost version: 1.63.0 [cmake]: – Found the following Boost libraries: [cmake]: – regex [cmake]: – Configuring done [cmake]: – Generating done [cmake]: – Build files have been written to: C:/Users/Student/eclipse-workspace/Test/intermediate/cmake/AXCF2152,19.0.0.17548/Release [cmake]: [ 12%] e[32mBuilding CXX object CMakeFiles/Test.dir/intermediate/code/MyComponent.meta.cpp.oe[0m [cmake]: [ 25%] e[32mBuilding CXX object CMakeFiles/Test.dir/intermediate/code/MyComponentProgramProvider.cpp.oe[0m [cmake]: [ 37%] e[32mBuilding CXX object CMakeFiles/Test.dir/intermediate/code/TestLibrary.cpp.oe[0m [cmake]: [ 50%] e[32mBuilding CXX object CMakeFiles/Test.dir/intermediate/code/TestLibrary.meta.cpp.oe[0m [cmake]: [ 62%] e[32mBuilding CXX object CMakeFiles/Test.dir/src/MyComponent.cpp.oe[0m [cmake]: [ 75%] e[32mBuilding CXX object CMakeFiles/Test.dir/src/MyProgram.cpp.oe[0m [cmake]: [ 87%] e[32me[1mLinking CXX shared library libTest.soe[0m [cmake]: arm-pxc-linux-gnueabi-g++.exe: error: CMakeFiles/Test.dir/intermediate/code/MyComponent.meta.cpp.o CMakeFiles/Test.dir/intermediate/code/MyComponentProgramProvider.cpp.o CMakeFiles/Test.dir/intermediate/code/TestLibrary.cpp.o CMakeFiles/Test.dir/intermediate/code/TestLibrary.meta.cpp.o CMakeFiles/Test.dir/src/MyComponent.cpp.o CMakeFiles/Test.dir/src/MyProgram.cpp.o : No such file or directory [cmake]: make.exe[2]: *** [CMakeFiles/Test.dir/build.make:185: libTest.so] Error 1 [cmake]: make.exe[1]: *** [CMakeFiles/Makefile2:73: CMakeFiles/Test.dir/all] Error 2 [cmake]: make.exe: *** [Makefile:130: all] Error 2 cmake process exited with error[/quote] Ich habe nach Video die Erstintallation realisiert, die lief ohne Fehler ab.

Hello papabaer, I can’t see your replies, please try to use another WebBrowser e.g. Firefox or GoogleChrome… -Eduard-

Hallo PLCnext Team, ich habe Probleme bei der Erstinbetriebnahme von Eclipse bzw. bei der Übersetzung einen Projektes. folgende Fehlermeldung habe ich(Logausdruck); Ich habe nach Video die Erstintallation realisiert, die lief ohne Fehler ab.

Dokument1.pdf

Hello, Can you please Clean the project (menu item Project → Clean …), run the build again, and send the output from that build? Martin.

Hallo, nach Projekt > Clean identischer Fehler. >> Windows 7, Eclipse 2019.03, Java openJGK 12…, PLCnCLI 2019.0, SDK 2019.3<< Ralph

Eclipse Fehler.pdf

Hallo Ralph, Kannst du mir bitte dein Projekt schicken? Ich werde es mir ansehen. - Martin.

Hallo Martin, ich habe dazu kein Projekt, genutzt habe ich das leere Template bei der Erstellung des Eclipse Projektes, ohne jegliche Füllung eigener Inhalte. Ich nehme aber an, dass die Probleme durch Installation anderer Software auftreten, nach Windows Neuinstallation und und Installation von Eclipse, plcnext u.s.w läuft mittlerweile mein System. mfg Ralph